Target
Coagulation factor XII
Ligand
BDBM50229987
Substrate
Meas. Tech.
ChEBML_1644378
Ki
9.3±n/a nM
Citation
 Middendorp, SJWilbs, JQuarroz, CCalzavarini, SAngelillo-Scherrer, AHeinis, C Peptide Macrocycle Inhibitor of Coagulation Factor XII with Subnanomolar Affinity and High Target Selectivity. J Med Chem 60:1151-1158 (2017)  
Target
Name:
Coagulation factor XII
Synonyms:
Beta-factor XIIa part 1 Carboxylesterase 2 (intestine, liver) Coagulation factor XII (FXII) Coagulation factor XIIa light chain FA12_HUMAN Factor XIIa (fXIIa) Hageman factor
Type:
Enzyme
Mol. Mass.:
67810.07
Organism:
Homo sapiens (Human)
Description:
P00748
Residue:
615
  
Inhibitor
Name:
BDBM50229987
Synonyms:
CHEMBL4095948
Type:
Small organic molecule
Emp. Form.:
C76H126N28O17S3
Mol. Mass.:
1800.186
SMILES:
CC(C)C[C@@H]1NC(=O)[C@H](CCC(N)=O)NC(=O)[C@H](CCCNC(N)=N)NC(=O)[C@@H]2CSCCC(=O)N3CN(CN(C3)C(=O)CCSC[C@H](NC(=O)[C@@H](N)CCCNC(N)=N)C(=O)N[C@@H](Cc3ccccc3)C(=O)N[C@@H](CCCNC(N)=N)C(=O)N[C@@H](CC(C)C)C(=O)N3CCC[C@H]3C(=O)N2)C(=O)CCSC[C@H](NC(=O)[C@H](CCCNC(N)=N)NC1=O)C(O)=O
: