Target
Orexin/Hypocretin receptor type 1
Ligand
BDBM50230136
Substrate
Meas. Tech.
ChEMBL_1644403 (CHEMBL3993332)
Ki
3.5±n/a nM
Citation
 Nagase, HYamamoto, NYata, MOhrui, SOkada, TSaitoh, TKutsumura, NNagumo, YIrukayama-Tomobe, YIshikawa, YOgawa, YHirayama, SKuroda, DWatanabe, YGouda, HYanagisawa, M Design and Synthesis of Potent and Highly Selective Orexin 1 Receptor Antagonists with a Morphinan Skeleton and Their Pharmacologies. J Med Chem 60:1018-1040 (2017)  
Target
Name:
Orexin/Hypocretin receptor type 1
Synonyms:
HCRTR1 OX1R_HUMAN Orexin receptor type 1 (OR 1) Orexin receptor type 1 (OX1) Orexin receptor type 1 (OxR1) | Ox1r
Type:
Protein
Mol. Mass.:
47554.50
Organism:
Homo sapiens (Human)
Description:
O43613
Residue:
425
  
Inhibitor
Name:
BDBM50230136
Synonyms:
CHEMBL4068322 | US10377763, Example 18
Type:
Small organic molecule
Emp. Form.:
C31H31ClN2O7S
Mol. Mass.:
611.105
SMILES:
[H][C@@]12Oc3c4c(C[C@@]5([H])N(CC[C@@]14[C@@]5(O)CC[C@H]2N(C)C(=O)\C=C\c1ccoc1)S(=O)(=O)c1cccc(Cl)c1)ccc3OC
: