Target
Carbonic anhydrase 1
Ligand
BDBM50230201
Substrate
Meas. Tech.
ChEMBL_1644695 (CHEMBL3993624)
Ki
>100±n/a nM
Citation
 Bua, SDi Cesare Mannelli, LVullo, DGhelardini, CBartolucci, GScozzafava, ASupuran, CTCarta, F Design and Synthesis of Novel Nonsteroidal Anti-Inflammatory Drugs and Carbonic Anhydrase Inhibitors Hybrids (NSAIDs-CAIs) for the Treatment of Rheumatoid Arthritis. J Med Chem 60:1159-1170 (2017)  
Target
Name:
Carbonic anhydrase 1
Synonyms:
CA-I CAB Carbonate dehydratase I Carbonic anhydrase 1 (CA I) Carbonic anhydrase 1 (Recombinant CA I) Carbonic anhydrase B Carbonic anhydrase I (CA I) Carbonic anhydrase I (CAI) Carbonic anhydrase isoenzyme I (hCA I) | hCA
Type:
Enzyme
Mol. Mass.:
28873.37
Organism:
Homo sapiens (Human)
Description:
P00915
Residue:
261
  
Inhibitor
Name:
BDBM50230201
Synonyms:
CHEMBL4103176
Type:
Small organic molecule
Emp. Form.:
C25H20Cl2N2O4
Mol. Mass.:
483.343
SMILES:
Clc1cccc(Cl)c1Nc1ccccc1CC(=O)NCCOc1ccc2ccc(=O)oc2c1
: