Target
Carbonic anhydrase 4
Ligand
BDBM50230200
Substrate
Meas. Tech.
ChEMBL_1644697 (CHEMBL3993626)
Ki
9.5±n/a nM
Citation
 Bua, SDi Cesare Mannelli, LVullo, DGhelardini, CBartolucci, GScozzafava, ASupuran, CTCarta, F Design and Synthesis of Novel Nonsteroidal Anti-Inflammatory Drugs and Carbonic Anhydrase Inhibitors Hybrids (NSAIDs-CAIs) for the Treatment of Rheumatoid Arthritis. J Med Chem 60:1159-1170 (2017)  
Target
Name:
Carbonic anhydrase 4
Synonyms:
CA-IV CAH4_HUMAN Carbonic anhydrase Carbonic anhydrase IV (CA IV)
Type:
Enzyme
Mol. Mass.:
35037.98
Organism:
Homo sapiens (Human)
Description:
P22748
Residue:
312
  
Inhibitor
Name:
BDBM50230200
Synonyms:
CHEMBL4079848
Type:
Small organic molecule
Emp. Form.:
C27H23NO5
Mol. Mass.:
441.4752
SMILES:
CC(C(=O)NCCOc1ccc2ccc(=O)oc2c1)c1cccc(c1)C(=O)c1ccccc1
: