Target
Carbonic anhydrase 4
Ligand
BDBM50230206
Substrate
Meas. Tech.
ChEMBL_1644697 (CHEMBL3993626)
Ki
9.4±n/a nM
Citation
 Bua, SDi Cesare Mannelli, LVullo, DGhelardini, CBartolucci, GScozzafava, ASupuran, CTCarta, F Design and Synthesis of Novel Nonsteroidal Anti-Inflammatory Drugs and Carbonic Anhydrase Inhibitors Hybrids (NSAIDs-CAIs) for the Treatment of Rheumatoid Arthritis. J Med Chem 60:1159-1170 (2017)  
Target
Name:
Carbonic anhydrase 4
Synonyms:
CA-IV CAH4_HUMAN Carbonic anhydrase Carbonic anhydrase IV (CA IV)
Type:
Enzyme
Mol. Mass.:
35037.98
Organism:
Homo sapiens (Human)
Description:
P22748
Residue:
312
  
Inhibitor
Name:
BDBM50230206
Synonyms:
CHEMBL4094868
Type:
Small organic molecule
Emp. Form.:
C26H22N2O5
Mol. Mass.:
442.4633
SMILES:
O=C(NCCOc1ccc2ccc(=O)oc2c1)C1CCn2c1ccc2C(=O)c1ccccc1
: