Target
Peptidyl-prolyl cis-trans isomerase A
Ligand
BDBM50230211
Substrate
Meas. Tech.
ChEMBL_1644714 (CHEMBL3993643)
Kd
48±n/a nM
Citation
 Steadman, VAPettit, SBPoullennec, KGLazarides, LKeats, AJDean, DKStanway, SJAustin, CASanvoisin, JAWatt, GMFliri, HGLiclican, ACJin, DWong, MHLeavitt, SALee, YJTian, YFrey, CRAppleby, TCSchmitz, UJansa, PMackman, RLSchultz, BE Discovery of Potent Cyclophilin Inhibitors Based on the Structural Simplification of Sanglifehrin A. J Med Chem 60:1000-1017 (2017)  
Target
Name:
Peptidyl-prolyl cis-trans isomerase A
Synonyms:
CYPA Cyclophilin A PPIA PPIase A Rotamase A
Type:
Protein
Mol. Mass.:
18015.32
Organism:
Homo sapiens (Human)
Description:
P62937
Residue:
165
  
Inhibitor
Name:
BDBM50230211
Synonyms:
CHEMBL4063126
Type:
Small organic molecule
Emp. Form.:
C28H40N4O5
Mol. Mass.:
512.641
SMILES:
CC(C)[C@@H]1NC(=O)CCCC\C=C\c2cccc(c2)[C@@H](C)OC(=O)[C@@H]2CCCN(N2)C(=O)[C@H](C)NC1=O
: