Target
Coagulation factor XI
Ligand
BDBM50230327
Substrate
Meas. Tech.
ChEBML_1644767
Ki
3.8±n/a nM
Citation
 Corte, JRFang, TOsuna, HPinto, DJRossi, KAMyers, JESheriff, SLou, ZZheng, JJHarper, TWBozarth, JMWu, YLuettgen, JMSeiffert, DADecicco, CPWexler, RRQuan, ML Structure-Based Design of Macrocyclic Factor XIa Inhibitors: Discovery of the Macrocyclic Amide Linker. J Med Chem 60:1060-1075 (2017)  
Target
Name:
Coagulation factor XI
Synonyms:
Coagulation factor XIa Coagulation factor XIa light chain FA11_HUMAN Factor XIa PTA | Plasma thromboplastin antecedent
Type:
Enzyme
Mol. Mass.:
70130.58
Organism:
Homo sapiens (Human)
Description:
P03951
Residue:
625
  
Inhibitor
Name:
BDBM50230327
Synonyms:
CHEMBL4082071
Type:
Small organic molecule
Emp. Form.:
C27H26ClN9O5
Mol. Mass.:
592.006
SMILES:
COC(=O)Nc1ccc2-c3c[nH]c(n3)[C@H](CCCCOC(=O)Nc2c1)NC(=O)\C=C\c1cc(Cl)ccc1-n1cnnn1
: