Target
D-3-phosphoglycerate dehydrogenase
Ligand
BDBM50230356
Substrate
Meas. Tech.
ChEBML_1644833
IC50
7000±n/a nM
Citation
 Ravez, SCorbet, CSpillier, QDutu, ARobin, ADMullarky, ECantley, LCFeron, OFrédérick, R a-Ketothioamide Derivatives: A Promising Tool to Interrogate Phosphoglycerate Dehydrogenase (PHGDH). J Med Chem 60:1591-1597 (2017)  
Target
Name:
D-3-phosphoglycerate dehydrogenase
Synonyms:
D-3-phosphoglycerate dehydrogenase PHGDH SERA_HUMAN
Type:
Protein
Mol. Mass.:
56650.89
Organism:
Homo sapiens (Human)
Description:
Residue:
533
  
Inhibitor
Name:
BDBM50230356
Synonyms:
(3,4-DICHLOROPHENYL)(MORPHOLINO)METHANETHIONE
Type:
Small organic molecule
Emp. Form.:
C11H11Cl2NOS
Mol. Mass.:
276.182
SMILES:
Clc1ccc(cc1Cl)C(=S)N1CCOCC1
: