Target
Carbonic anhydrase 2
Ligand
BDBM50230944
Substrate
Meas. Tech.
ChEMBL_1644986 (CHEMBL3993915)
Ki
9.4±n/a nM
Citation
 Eldehna, WMAl-Ansary, GHBua, SNocentini, AGratteri, PAltoukhy, AGhabbour, HAhmed, HYSupuran, CT Novel indolin-2-one-based sulfonamides as carbonic anhydrase inhibitors: Synthesis, in vitro biological evaluation against carbonic anhydrases isoforms I, II, IV and VII and molecular docking studies. Eur J Med Chem 127:521-530 (2017)  
Target
Name:
Carbonic anhydrase 2
Synonyms:
CA-II CAC Carbonate dehydratase II Carbonic anhydrase 2 (CA-II) Carbonic anhydrase C Carbonic anhydrase II (CA-II) Carbonic anhydrase II (hCA II) | Carbonic anhydrase isoenzyme II (hCA II)
Type:
Enzyme
Mol. Mass.:
29250.71
Organism:
Homo sapiens (Human)
Description:
P00918
Residue:
260
  
Inhibitor
Name:
BDBM50230944
Synonyms:
CHEMBL4088398
Type:
Small organic molecule
Emp. Form.:
C16H14BrN3O3S
Mol. Mass.:
408.27
SMILES:
NS(=O)(=O)c1ccc(CC\N=C2/C(=O)Nc3ccc(Br)cc23)cc1
: