Target
Carbonic anhydrase 4
Ligand
BDBM50230940
Substrate
Meas. Tech.
ChEMBL_1644987 (CHEMBL3993916)
Ki
16±n/a nM
Citation
 Eldehna, WMAl-Ansary, GHBua, SNocentini, AGratteri, PAltoukhy, AGhabbour, HAhmed, HYSupuran, CT Novel indolin-2-one-based sulfonamides as carbonic anhydrase inhibitors: Synthesis, in vitro biological evaluation against carbonic anhydrases isoforms I, II, IV and VII and molecular docking studies. Eur J Med Chem 127:521-530 (2017)  
Target
Name:
Carbonic anhydrase 4
Synonyms:
CA-IV CAH4_HUMAN Carbonic anhydrase Carbonic anhydrase IV (CA IV)
Type:
Enzyme
Mol. Mass.:
35037.98
Organism:
Homo sapiens (Human)
Description:
P22748
Residue:
312
  
Inhibitor
Name:
BDBM50230940
Synonyms:
CHEMBL4069845
Type:
Small organic molecule
Emp. Form.:
C17H17N3O3S
Mol. Mass.:
343.4
SMILES:
CN1C(=O)\C(=N/CCc2ccc(cc2)S(N)(=O)=O)c2ccccc12
: