Target
Amine oxidase [flavin-containing] A
Ligand
BDBM15581
Substrate
Meas. Tech.
ChEMBL_1645422 (CHEMBL3994351)
IC50
2.7±n/a nM
Citation
 Luo, LLi, YQiang, XCao, ZXu, RYang, XXiao, GSong, QTan, ZDeng, Y Multifunctional thioxanthone derivatives with acetylcholinesterase, monoamine oxidases andß-amyloid aggregation inhibitory activities as potential agents against Alzheimer's disease. Bioorg Med Chem 25:1997-2009 (2017)  
Target
Name:
Amine oxidase [flavin-containing] A
Synonyms:
AOFA_HUMAN MAO-A Monoamine oxidase Monoamine oxidase type A (MAO A) Monoamine oxidase type A (MAOA)
Type:
Protein
Mol. Mass.:
59689.53
Organism:
Homo sapiens (Human)
Description:
P21397
Residue:
527
  
Inhibitor
Name:
BDBM15581
Synonyms:
CHEMBL8706 CLORGILINE N-[3-(2,4-dichlorophenoxy)propyl]-N-methyl-prop-2-yn-1-amine US9603833, Clorgyline | [3-(2,4-dichlorophenoxy)propyl](methyl)prop-2-yn-1-ylamine
Type:
Small organic molecule
Emp. Form.:
C13H15Cl2NO
Mol. Mass.:
272.17
SMILES:
CN(CCCOc1ccc(Cl)cc1Cl)CC#C
: