Target
Adenosine receptor A1
Ligand
BDBM50231593
Substrate
Meas. Tech.
ChEMBL_1645467 (CHEMBL3994396)
Ki
9.6±n/a nM
Citation
 Koul, SRamdas, VBarawkar, DAWaman, YBPrasad, NMadadi, SKShejul, YDBonagiri, RBasu, SMenon, SReddy, SBChaturvedi, SChennamaneni, SRBedse, GThakare, RGundu, JChaudhary, SDe, SMeru, AVPalle, VChugh, AMookhtiar, KA Design and synthesis of novel, potent and selective hypoxanthine analogs as adenosine A Bioorg Med Chem 25:1963-1975 (2017)  
Target
Name:
Adenosine receptor A1
Synonyms:
A1 adenosine receptor (hA1) AA1R_HUMAN ADORA1 Adenosine A1-receptor Adenosine receptor A1 (hA1) | Adenosine transporter (AdT)
Type:
G Protein-Coupled Receptor (GPCR)
Mol. Mass.:
36520.92
Organism:
Homo sapiens (Human)
Description:
P30542
Residue:
326
  
Inhibitor
Name:
BDBM50231593
Synonyms:
CHEMBL4068469
Type:
Small organic molecule
Emp. Form.:
C18H26N4O3
Mol. Mass.:
346.424
SMILES:
CCCn1c(OC2CCC(O)C2)nc2nc([nH]c2c1=O)C1CCCC1
: