Target
Succinate dehydrogenase [ubiquinone] iron-sulfur subunit, mitochondrial
Ligand
BDBM50231818
Substrate
Meas. Tech.
ChEMBL_1645572 (CHEMBL3994501)
EC50
364±n/a nM
Citation
 Li, LJiang, XHuang, SYing, ZZhang, ZPan, CLi, SWang, XZhang, Z Discovery of Highly Potent 2-Sulfonyl-Pyrimidinyl Derivatives for Apoptosis Inhibition and Ischemia Treatment. ACS Med Chem Lett 8:407-412 (2017)  
Target
Name:
Succinate dehydrogenase [ubiquinone] iron-sulfur subunit, mitochondrial
Synonyms:
1.3.5.1 SDH SDHB Succinate dehydrogenase [ubiquinone] iron-sulfur subunit, mitochondrial
Type:
PROTEIN
Mol. Mass.:
31643.02
Organism:
Homo sapiens (Human)
Description:
ChEMBL_117429
Residue:
280
  
Inhibitor
Name:
BDBM50231818
Synonyms:
CHEMBL4101603 | US11725000, Compound 147
Type:
Small organic molecule
Emp. Form.:
C24H26F3N3O5S
Mol. Mass.:
525.541
SMILES:
CCCCCS(=O)(=O)c1nc(cc(n1)C(F)(F)F)-c1ccc(=O)n(Cc2ccc(OC)c(OC)c2)c1
: