Target
Polycomb protein EED
Ligand
BDBM50231868
Substrate
Meas. Tech.
ChEMBL_1645614 (CHEMBL3994543)
IC50
20±n/a nM
Citation
 Baranczak, ATu, NPMarjanovic, JSearle, PAVasudevan, ADjuric, SW Integrated Platform for Expedited Synthesis-Purification-Testing of Small Molecule Libraries. ACS Med Chem Lett 8:461-465 (2017)  
Target
Name:
Polycomb protein EED
Synonyms:
EED WAIT-1 hEED
Type:
Protein
Mol. Mass.:
50201.68
Organism:
Homo sapiens (Human)
Description:
O75530
Residue:
441
  
Inhibitor
Name:
BDBM50231868
Synonyms:
CHEMBL4093911
Type:
Small organic molecule
Emp. Form.:
C31H36ClFN4O
Mol. Mass.:
535.095
SMILES:
CN(C)[C@H]1CN(Cc2c(C)cccc2F)C[C@@H]1c1ccc(cc1)N1CCN(CC1)C(=O)c1ccc(Cl)cc1
: