Target
Adenosine receptor A2b
Ligand
BDBM50232091
Substrate
Meas. Tech.
ChEMBL_1646018 (CHEMBL3995074)
Ki
11±n/a nM
Target
Name:
Adenosine receptor A2b
Synonyms:
AA2BR_HUMAN ADORA2B Adenosine receptors A2b | Adenosine receptors; A2a & A2b
Type:
G Protein-Coupled Receptor (GPCR)
Mol. Mass.:
36341.22
Organism:
Homo sapiens (Human)
Description:
Residue:
332
  
Inhibitor
Name:
BDBM50232091
Synonyms:
CHEMBL4098199
Type:
Small organic molecule
Emp. Form.:
C26H30F2N8O3
Mol. Mass.:
540.565
SMILES:
CCCn1c2nc([nH]c2c(=O)n(CCC)c1=O)-c1cnn(CC(=O)N2CCN(CC2)c2ccc(F)cc2F)c1
: