Target
Tyrosine-protein phosphatase non-receptor type 1
Ligand
BDBM50232095
Substrate
Meas. Tech.
ChEMBL_1646039 (CHEMBL3995095)
IC50
1900±n/a nM
Citation
 Ottaną, RPaoli, PNaß, ALori, GCardile, VAdornato, IRotondo, AGraziano, ACEWolber, GMaccari, R Discovery of 4-[(5-arylidene-4-oxothiazolidin-3-yl)methyl]benzoic acid derivatives active as novel potent allosteric inhibitors of protein tyrosine phosphatase 1B: In silico studies and in vitro evaluation as insulinomimetic and anti-inflammatory agents. Eur J Med Chem 127:840-858 (2017)  
Target
Name:
Tyrosine-protein phosphatase non-receptor type 1
Synonyms:
PTN1_HUMAN PTPN1 Protein tyrosine phosphatase-1B (PTP1B) Protein-tyrosine phosphatase 1B (PTP1B) Tyrosine-protein phosphatase non-receptor type 1 (PTP1B)
Type:
Protein phosphatase
Mol. Mass.:
49963.76
Organism:
Homo sapiens (Human)
Description:
Human recombinant GST-fusion PTP1B (1-435).
Residue:
435
  
Inhibitor
Name:
BDBM50232095
Synonyms:
CHEMBL4081501
Type:
Small organic molecule
Emp. Form.:
C26H21NO4S2
Mol. Mass.:
475.579
SMILES:
OC(=O)c1ccc(CN2C(=S)S\C(=C/c3cccc(OCCc4ccccc4)c3)C2=O)cc1
: