Target
17-beta-hydroxysteroid dehydrogenase type 2
Ligand
BDBM50232105
Substrate
Meas. Tech.
ChEMBL_1646099 (CHEMBL3995155)
IC50
140±n/a nM
Citation
 Abdelsamie, ASvan Koppen, CJBey, ESalah, MBörger, CSiebenbürger, LLaschke, MWMenger, MDFrotscher, M Treatment of estrogen-dependent diseases: Design, synthesis and profiling of a selective 17ß-HSD1 inhibitor with sub-nanomolar IC Eur J Med Chem 127:944-957 (2017)  
Target
Name:
17-beta-hydroxysteroid dehydrogenase type 2
Synonyms:
17-beta-Hydroxysteroid Dehydrogenase 2 (17-beta-HSD2) 20-alpha-HSD EDH17B2 Estradiol 17-beta-dehydrogenase 2 (17beta-HSD2) Microsomal 17-beta-hydroxysteroid dehydrogenas Testosterone 17-beta-dehydrogenase
Type:
Oxidoreductase; single-pass type II membrane protein
Mol. Mass.:
42795.29
Organism:
Homo sapiens (Human)
Description:
Enzyme was partially purified from human placenta.
Residue:
387
  
Inhibitor
Name:
BDBM50232105
Synonyms:
CHEMBL4084832
Type:
Small organic molecule
Emp. Form.:
C17H10F2O2S
Mol. Mass.:
316.322
SMILES:
Oc1cccc(c1)C(=O)c1ccc(s1)-c1ccc(F)cc1F
: