Target
Gamma-aminobutyric acid receptor subunit alpha-1
Ligand
BDBM50232200
Substrate
Meas. Tech.
ChEMBL_1646144 (CHEMBL3995200)
Ki
7±n/a nM
Citation
 Cherukupalli, SKarpoormath, RChandrasekaran, BHampannavar, GAThapliyal, NPalakollu, VN An insight on synthetic and medicinal aspects of pyrazolo[1,5-a]pyrimidine scaffold. Eur J Med Chem 126:298-352 (2017)  
Target
Name:
Gamma-aminobutyric acid receptor subunit alpha-1
Synonyms:
Benzodiazepine central GABA A Benzodiazepine GABA A Benzodiazepine Type II GABA A Benzodiazepine Type IIM GABA A Benzodiazepine omega2 GABA A alpha1 GABA receptor alpha-1 subunit GABA-PICROTOXIN Gabra-1 TBPS
Type:
Enzyme
Mol. Mass.:
51770.21
Organism:
Rattus norvegicus (Rat)
Description:
P62813
Residue:
455
  
Inhibitor
Name:
BDBM50232200
Synonyms:
CHEMBL4081736
Type:
Small organic molecule
Emp. Form.:
C15H10N4OS
Mol. Mass.:
294.331
SMILES:
O=c1c(c[nH]c2c(cnn12)-c1ccccn1)-c1ccsc1
: