Target
Peroxisome proliferator-activated receptor gamma
Ligand
BDBM50232210
Substrate
Meas. Tech.
ChEMBL_1646206 (CHEMBL3995262)
EC50
290±n/a nM
Citation
 Obermoser, VMauersberger, RSchuster, DCzifersky, MLipova, MSiegl, MKintscher, UGust, R Importance of 5/6-aryl substitution on the pharmacological profile of 4'-((2-propyl-1H-benzo[d]imidazol-1-yl)methyl)-[1,1'-biphenyl]-2-carboxylic acid derived PPAR¿ agonists. Eur J Med Chem 126:590-603 (2017)  
Target
Name:
Peroxisome proliferator-activated receptor gamma
Synonyms:
NR1C3 PPAR-gamma PPARG_HUMAN Peroxisome proliferator-activated receptor gamma (PPAR gamma) Peroxisome proliferator-activated receptor gamma (PPARγ) peroxisome proliferator-activated receptor gamma isoform 2
Type:
Nuclear Receptor
Mol. Mass.:
57613.46
Organism:
Homo sapiens (Human)
Description:
P37231
Residue:
505
  
Inhibitor
Name:
BDBM50232210
Synonyms:
CHEMBL4078107
Type:
Small organic molecule
Emp. Form.:
C31H28N2O3
Mol. Mass.:
476.5656
SMILES:
CCCc1nc2cc(ccc2n1Cc1ccc(cc1)-c1ccccc1C(O)=O)-c1cccc(OC)c1
: