Target
Acetylcholinesterase
Ligand
BDBM50232245
Substrate
Meas. Tech.
ChEMBL_1646248 (CHEMBL3995304)
IC50
710±n/a nM
Citation
 Liu, HLiu, LGao, XLiu, YXu, WHe, WJiang, HTang, JFan, HXia, X Novel ferulic amide derivatives with tertiary amine side chain as acetylcholinesterase and butyrylcholinesterase inhibitors: The influence of carbon spacer length, alkylamine and aromatic group. Eur J Med Chem 126:810-822 (2017)  
Target
Name:
Acetylcholinesterase
Synonyms:
ACES_HUMAN Acetylcholinesterase (AChE) | Acetylcholinesterase (human AChE)
Type:
Enzyme
Mol. Mass.:
67792.70
Organism:
Homo sapiens (Human)
Description:
P22303
Residue:
614
  
Inhibitor
Name:
BDBM50232245
Synonyms:
CHEMBL4080105
Type:
Small organic molecule
Emp. Form.:
C27H36N2O3
Mol. Mass.:
436.5863
SMILES:
COc1cc(\C=C\C(=O)Nc2ccccc2)ccc1OCCCCCCN1CCCCC1
: