Target
Cholinesterase
Ligand
BDBM50232312
Substrate
Meas. Tech.
ChEMBL_1646249 (CHEMBL3995305)
IC50
5690±n/a nM
Citation
 Liu, HLiu, LGao, XLiu, YXu, WHe, WJiang, HTang, JFan, HXia, X Novel ferulic amide derivatives with tertiary amine side chain as acetylcholinesterase and butyrylcholinesterase inhibitors: The influence of carbon spacer length, alkylamine and aromatic group. Eur J Med Chem 126:810-822 (2017)  
Target
Name:
Cholinesterase
Synonyms:
Acylcholine acylhydrolase Butyrylcholine esterase (BChE) Butyrylcholinesterase (BuChE) CHLE_HUMAN Cholinesterases Pseudocholinesterase
Type:
Homotetramer
Mol. Mass.:
68422.27
Organism:
Homo sapiens (Human)
Description:
P06276
Residue:
602
  
Inhibitor
Name:
BDBM50232312
Synonyms:
CHEMBL4069385
Type:
Small organic molecule
Emp. Form.:
C25H32N2O3
Mol. Mass.:
408.5332
SMILES:
COc1cc(\C=C\C(=O)Nc2ccccc2)ccc1OCCCCN1CCCCC1
: