Target
Epidermal growth factor receptor
Ligand
BDBM50232337
Substrate
Meas. Tech.
ChEMBL_1646279 (CHEMBL3995335)
IC50
70000±n/a nM
Citation
 Akhtar, MJSiddiqui, AAKhan, AAAli, ZDewangan, RPPasha, SYar, MS Design, synthesis, docking and QSAR study of substituted benzimidazole linked oxadiazole as cytotoxic agents, EGFR and erbB2 receptor inhibitors. Eur J Med Chem 126:853-869 (2017)  
Target
Name:
Epidermal growth factor receptor
Synonyms:
EGF Receptor Substrate EGFR_HUMAN ERBB1 Epidermal Growth Factor Receptor erbB-1 Epidermal growth factor receptor (EGFR) HER1 Proto-oncogene c-ErbB-1 Tyrosine-Protein Kinase ErbB-1
Type:
Receptor Kinase Domain
Mol. Mass.:
134279.59
Organism:
Homo sapiens (Human)
Description:
P00533
Residue:
1210
  
Inhibitor
Name:
BDBM50232337
Synonyms:
CHEMBL4094647
Type:
Small organic molecule
Emp. Form.:
C16H13N5O2
Mol. Mass.:
307.3067
SMILES:
Nc1ccc(O)c(c1)-c1nnc(Cc2nc3ccccc3[nH]2)o1
: