Target
Epidermal growth factor receptor
Ligand
BDBM50232321
Substrate
Meas. Tech.
ChEMBL_1646279 (CHEMBL3995335)
IC50
3698±n/a nM
Citation
 Akhtar, MJSiddiqui, AAKhan, AAAli, ZDewangan, RPPasha, SYar, MS Design, synthesis, docking and QSAR study of substituted benzimidazole linked oxadiazole as cytotoxic agents, EGFR and erbB2 receptor inhibitors. Eur J Med Chem 126:853-869 (2017)  
Target
Name:
Epidermal growth factor receptor
Synonyms:
EGF Receptor Substrate EGFR_HUMAN ERBB1 Epidermal Growth Factor Receptor erbB-1 Epidermal growth factor receptor (EGFR) HER1 Proto-oncogene c-ErbB-1 Tyrosine-Protein Kinase ErbB-1
Type:
Receptor Kinase Domain
Mol. Mass.:
134279.59
Organism:
Homo sapiens (Human)
Description:
P00533
Residue:
1210
  
Inhibitor
Name:
BDBM50232321
Synonyms:
CHEMBL4079125
Type:
Small organic molecule
Emp. Form.:
C16H10Cl2N4O
Mol. Mass.:
345.183
SMILES:
Clc1ccc(-c2nnc(Cc3nc4ccccc4[nH]3)o2)c(Cl)c1
: