Target
Protein mono-ADP-ribosyltransferase PARP16
Ligand
BDBM50145156
Substrate
Meas. Tech.
ChEBML_1646316
IC50
1862±n/a nM
Citation
 Thorsell, AGEkblad, TKarlberg, TLöw, MPinto, AFTrésaugues, LMoche, MCohen, MSSchüler, H Structural Basis for Potency and Promiscuity in Poly(ADP-ribose) Polymerase (PARP) and Tankyrase Inhibitors. J Med Chem 60:1262-1271 (2017)  
Target
Name:
Protein mono-ADP-ribosyltransferase PARP16
Synonyms:
2.4.2.30 ARTD15 Mono [ADP-ribose] polymerase PARP16 PARP-16 Poly [ADP-ribose] polymerase 16 | Synonyms=ARTD15
Type:
PROTEIN
Mol. Mass.:
36398.93
Organism:
Homo sapiens (Human)
Description:
ChEMBL_117586
Residue:
322
  
Inhibitor
Name:
BDBM50145156
Synonyms:
CHEMBL3764816
Type:
Small organic molecule
Emp. Form.:
C19H14F2N6O
Mol. Mass.:
380.3509
SMILES:
Cn1ncnc1[C@H]1[C@@H](Nc2cc(F)cc3c2c1n[nH]c3=O)c1ccc(F)cc1
: