Target
Amine oxidase [flavin-containing] B
Ligand
BDBM50046877
Substrate
Meas. Tech.
ChEMBL_1647768 (CHEMBL3996824)
IC50
1.6±n/a nM
Citation
 Tzvetkov, NTStammler, HGNeumann, BHristova, SAntonov, LGastreich, M Crystal structures, binding interactions, and ADME evaluation of brain penetrant N-substituted indazole-5-carboxamides as subnanomolar, selective monoamine oxidase B and dual MAO-A/B inhibitors. Eur J Med Chem 127:470-492 (2017)  
Target
Name:
Amine oxidase [flavin-containing] B
Synonyms:
AOFB_HUMAN MAOB Monoamine oxidase type B (MAO B) Monoamine oxidase type B (MAOB)
Type:
Protein
Mol. Mass.:
58768.76
Organism:
Homo sapiens (Human)
Description:
P27338
Residue:
520
  
Inhibitor
Name:
BDBM50046877
Synonyms:
CHEMBL3319248
Type:
Small organic molecule
Emp. Form.:
C14H9F2N3O
Mol. Mass.:
273.2376
SMILES:
Fc1ccc(NC(=O)c2ccc3[nH]ncc3c2)cc1F
: