Target
Amine oxidase [flavin-containing] B
Ligand
BDBM50046865
Substrate
Meas. Tech.
ChEMBL_1647768 (CHEMBL3996824)
IC50
1.4±n/a nM
Citation
 Tzvetkov, NTStammler, HGNeumann, BHristova, SAntonov, LGastreich, M Crystal structures, binding interactions, and ADME evaluation of brain penetrant N-substituted indazole-5-carboxamides as subnanomolar, selective monoamine oxidase B and dual MAO-A/B inhibitors. Eur J Med Chem 127:470-492 (2017)  
Target
Name:
Amine oxidase [flavin-containing] B
Synonyms:
AOFB_HUMAN MAOB Monoamine oxidase type B (MAO B) Monoamine oxidase type B (MAOB)
Type:
Protein
Mol. Mass.:
58768.76
Organism:
Homo sapiens (Human)
Description:
P27338
Residue:
520
  
Inhibitor
Name:
BDBM50046865
Synonyms:
CHEMBL3319257
Type:
Small organic molecule
Emp. Form.:
C15H11Cl2N3O
Mol. Mass.:
320.173
SMILES:
Cn1cc2cc(ccc2n1)C(=O)Nc1ccc(Cl)c(Cl)c1
: