Target
Amine oxidase [flavin-containing] B
Ligand
BDBM50232429
Substrate
Meas. Tech.
ChEMBL_1647767 (CHEMBL3996823)
IC50
3.8±n/a nM
Citation
 Tzvetkov, NTStammler, HGNeumann, BHristova, SAntonov, LGastreich, M Crystal structures, binding interactions, and ADME evaluation of brain penetrant N-substituted indazole-5-carboxamides as subnanomolar, selective monoamine oxidase B and dual MAO-A/B inhibitors. Eur J Med Chem 127:470-492 (2017)  
Target
Name:
Amine oxidase [flavin-containing] B
Synonyms:
AOFB_RAT Amine oxidase [flavin-containing] B Monoamine Oxidase Type B (MAO-B) Monoamine oxidase B (MAO-B) Monoamine oxidase type B (MAOB) | Monoamine oxidase-B (MAO-B)
Type:
Enzyme
Mol. Mass.:
58469.65
Organism:
Rattus norvegicus (rat)
Description:
P19643
Residue:
520
  
Inhibitor
Name:
BDBM50232429
Synonyms:
CHEMBL4104691
Type:
Small organic molecule
Emp. Form.:
C17H15Cl2N3O2
Mol. Mass.:
364.226
SMILES:
COCCn1ncc2cc(ccc12)C(=O)Nc1ccc(Cl)c(Cl)c1
: