Target
High affinity nerve growth factor receptor
Ligand
BDBM50022672
Substrate
Meas. Tech.
ChEMBL_1647978 (CHEMBL3997034)
IC50
119±n/a nM
Citation
 Furuya, NMomose, TKatsuno, KFushimi, NMuranaka, HHanda, COzawa, TKinoshita, T The juxtamembrane region of TrkA kinase is critical for inhibitor selectivity. Bioorg Med Chem Lett 27:1233-1236 (2017)  
Target
Name:
High affinity nerve growth factor receptor
Synonyms:
2.7.10.1 NTRK1 NTRK1_HUMAN Neurotrophic tyrosine kinase receptor type 1 Synonyms=MTC TRK1-transforming tyrosine kinase protein TRKA GN Tropomyosin alpha-3 chain/High affinity nerve growth factor receptor Tropomyosin-related kinase A (TrkA) Tyrosine kinase receptor (Trk) Tyrosine kinase receptor A (Trk A) Tyrosine kinase receptor A (TrkA) p140-TrkA
Type:
Mol. Mass.:
87498.18
Organism:
Homo sapiens (Human)
Description:
P04629
Residue:
796
  
Inhibitor
Name:
BDBM50022672
Synonyms:
CHEMBL3298266
Type:
Small organic molecule
Emp. Form.:
C27H26N8O2
Mol. Mass.:
494.5477
SMILES:
COc1cc(ccc1-n1cnc(C)c1)-c1cn(CC(=O)Nc2cc(nn2-c2ccccc2)C2CC2)nn1
: