Target
Prostaglandin E2 receptor EP4 subtype
Ligand
BDBM50232546
Substrate
Meas. Tech.
ChEMBL_1648054 (CHEMBL3997110)
Ki
73±n/a nM
Citation
 Okumura, YYamagishi, TNukui, SNakao, K Discovery of AAT-008, a novel, potent, and selective prostaglandin EP4 receptor antagonist. Bioorg Med Chem Lett 27:1186-1192 (2017)  
Target
Name:
Prostaglandin E2 receptor EP4 subtype
Synonyms:
PE2R4_HUMAN PGE2 receptor EP4 subtype PTGER4 Prostanoid EP4 receptor
Type:
Enzyme
Mol. Mass.:
53134.53
Organism:
Homo sapiens (Human)
Description:
P35408
Residue:
488
  
Inhibitor
Name:
BDBM50232546
Synonyms:
CHEMBL4103046
Type:
Small organic molecule
Emp. Form.:
C20H14F2N2O4
Mol. Mass.:
384.333
SMILES:
OC(=O)c1ccc(CNC(=O)c2cc(F)cnc2Oc2ccc(F)cc2)cc1
: