Target
Neuronal acetylcholine receptor subunit alpha-3/beta-4
Ligand
BDBM50232601
Substrate
Meas. Tech.
ChEMBL_1648187 (CHEMBL3997243)
EC50
>100000±n/a nM
Citation
 Iwuagwu, CKing, DMcDonald, IMCook, JZusi, FCHill, MDMate, RAFang, HKnox, RGallagher, LPost-Munson Amy Easton, DMiller, RBenitex, YSiuciak, JLodge, NZaczek, RMorgan, DBristow, LMacor, JEOlson, RE Design and synthesis of a novel series of 4-heteroarylamino-1'-azaspiro[oxazole-5,3'-bicyclo[2.2.2]octanes asa7 nicotinic receptor agonists 2. Development of 4-heteroaryl SAR. Bioorg Med Chem Lett 27:1261-1266 (2017)  
Target
Name:
Neuronal acetylcholine receptor subunit alpha-3/beta-4
Synonyms:
Neuronal acetylcholine receptor protein alpha-3/beta-4 subunit | Neuronal acetylcholine receptor; alpha3/beta4
Type:
Mol. Mass.:
Description:
ASSAY_ID of ChEMBL is 1970247
Components:
This complex has 2 components.
Component 1
Name:
Neuronal acetylcholine receptor subunit beta-4
Synonyms:
ACHB4_HUMAN Cholinergic, Nicotinic Alpha6Beta3Beta4Alpha5 Nicotinic acetylcholine receptor alpha6/alpha3/beta4
Type:
Enzyme Catalytic Domain
Mol. Mass.:
56388.51
Organism:
Homo sapiens (Human)
Description:
Cholinergic, Nicotinic Alpha6Beta3Beta4Alpha5 0 HUMAN::P30926
Residue:
498
  
Component 2
Name:
Neuronal acetylcholine receptor subunit alpha-3
Synonyms:
ACHA3_HUMAN Cholinergic, Nicotinic Alpha3Beta2 Cholinergic, Nicotinic Alpha3Beta4x NACHRA3 Neuronal acetylcholine receptor subunit alpha-3 nicotinic central
Type:
Enzyme Catalytic Domain
Mol. Mass.:
57479.03
Organism:
Homo sapiens (Human)
Description:
Cholinergic, Nicotinic Alpha3Beta2 0 HUMAN::P32297
Residue:
505
  
Inhibitor
Name:
BDBM50232601
Synonyms:
CHEMBL4079623
Type:
Small organic molecule
Emp. Form.:
C14H19N5O2
Mol. Mass.:
289.333
SMILES:
COc1cc(NC2=NC[C@@]3(CN4CCC3CC4)O2)ncn1
: