Target
Glutaminase kidney isoform, mitochondrial
Ligand
BDBM50232189
Substrate
Meas. Tech.
ChEMBL_1648245 (CHEMBL3997301)
IC50
>100000±n/a nM
Citation
 Cheng, LWu, CRZhu, LHLi, HChen, LX Physapubescin, a natural withanolide as a kidney-type glutaminase (KGA) inhibitor. Bioorg Med Chem Lett 27:1243-1246 (2017)  
Target
Name:
Glutaminase kidney isoform, mitochondrial
Synonyms:
GLS GLSK_HUMAN K-glutaminase L-glutamine amidohydrolase
Type:
Protein
Mol. Mass.:
73471.89
Organism:
Homo sapiens (Human)
Description:
O94925
Residue:
669
  
Inhibitor
Name:
BDBM50232189
Synonyms:
CHEMBL4064324
Type:
Small organic molecule
Emp. Form.:
C28H46O6
Mol. Mass.:
478.6612
SMILES:
[H][C@@]1(CC[C@@]2([H])[C@]3([H])CC=C4C[C@@H](O)C[C@H](O)[C@]4(C)[C@@]3([H])CC[C@]12C)[C@H](C)[C@@]1([H])C[C@@](C)(O)[C@](C)(O)C(O)O1
: