Target
Tyrosine-protein phosphatase non-receptor type 1
Ligand
BDBM50232634
Substrate
Meas. Tech.
ChEMBL_1648335 (CHEMBL3997391)
IC50
9900±n/a nM
Citation
 Abdjul, DBYamazaki, HKanno, SIWewengkang, DSRotinsulu, HSumilat, DAUkai, KKapojos, MMNamikoshi, M Furanoterpenes, new types of protein tyrosine phosphatase 1B inhibitors, from two Indonesian marine sponges, Ircinia and Spongia spp. Bioorg Med Chem Lett 27:1159-1161 (2017)  
Target
Name:
Tyrosine-protein phosphatase non-receptor type 1
Synonyms:
PTN1_HUMAN PTPN1 Protein tyrosine phosphatase-1B (PTP1B) Protein-tyrosine phosphatase 1B (PTP1B) Tyrosine-protein phosphatase non-receptor type 1 (PTP1B)
Type:
Protein phosphatase
Mol. Mass.:
49963.76
Organism:
Homo sapiens (Human)
Description:
Human recombinant GST-fusion PTP1B (1-435).
Residue:
435
  
Inhibitor
Name:
BDBM50232634
Synonyms:
CHEBI:67726 | Furospongin 1
Type:
Small organic molecule
Emp. Form.:
C21H30O3
Mol. Mass.:
330.4611
SMILES:
C[C@@H](CCCc1ccoc1)C[C@@H](O)C\C(C)=C\CCc1ccoc1
: