Target
D(2) dopamine receptor
Ligand
BDBM50232672
Substrate
Meas. Tech.
ChEMBL_1648452 (CHEMBL3997508)
Ki
>10000±n/a nM
Citation
 Staron, JMordalski, SWarszycki, DSatala, GHogendorf, ABojarski, AJ Pyrano[2,3,4- ACS Med Chem Lett 8:390-394 (2017)  
Target
Name:
D(2) dopamine receptor
Synonyms:
D(2) dopamine receptor DOPAMINE D2 Long DRD2 Dopamine D2 receptor Dopamine D2 receptor (D2R) Dopamine2-like | d2
Type:
Cell-surface receptors
Mol. Mass.:
50647.10
Organism:
Homo sapiens (Human)
Description:
P14416
Residue:
443
  
Inhibitor
Name:
BDBM50232672
Synonyms:
CHEMBL4090862
Type:
Small organic molecule
Emp. Form.:
C22H17NO4S
Mol. Mass.:
391.44
SMILES:
Cc1c(CO)oc2cccc3n(cc1c23)S(=O)(=O)c1cccc2ccccc12
: