Target
5-hydroxytryptamine receptor 1A
Ligand
BDBM50232666
Substrate
Meas. Tech.
ChEMBL_1648449 (CHEMBL3997505)
Ki
5967±n/a nM
Citation
 Staron, JMordalski, SWarszycki, DSatala, GHogendorf, ABojarski, AJ Pyrano[2,3,4- ACS Med Chem Lett 8:390-394 (2017)  
Target
Name:
5-hydroxytryptamine receptor 1A
Synonyms:
5-HT-1A 5-hydroxytryptamine receptor 1A (5-HT-1A) ADRB2RL1 Dopamine D2 receptor and serotonin 1a receptor HTR1A | Serotonin receptor 1A
Type:
Mol. Mass.:
46122.49
Organism:
Homo sapiens (Human)
Description:
Residue:
422
  
Inhibitor
Name:
BDBM50232666
Synonyms:
CHEMBL4083059
Type:
Small organic molecule
Emp. Form.:
C23H20N2O3S
Mol. Mass.:
404.482
SMILES:
CN(C)Cc1cc2cn(c3cccc(o1)c23)S(=O)(=O)c1cccc2ccccc12
: