Target
5-hydroxytryptamine receptor 6
Ligand
BDBM50232673
Substrate
Meas. Tech.
ChEMBL_1648448 (CHEMBL3997504)
Ki
5.0±n/a nM
Citation
 Staron, JMordalski, SWarszycki, DSatala, GHogendorf, ABojarski, AJ Pyrano[2,3,4- ACS Med Chem Lett 8:390-394 (2017)  
Target
Name:
5-hydroxytryptamine receptor 6
Synonyms:
5-HT-6 5-hydroxytryptamine receptor 6 (5-HT-6) 5-hydroxytryptamine receptor 6 (5HT6) HTR6 Serotonin 6 (5-HT6) receptor | Serotonin Receptor 6
Type:
G Protein-Coupled Receptor (GPCR)
Mol. Mass.:
46968.43
Organism:
Homo sapiens (Human)
Description:
P50406
Residue:
440
  
Inhibitor
Name:
BDBM50232673
Synonyms:
CHEMBL4061189
Type:
Small organic molecule
Emp. Form.:
C19H20N2O3S
Mol. Mass.:
356.439
SMILES:
CN(C)CC1=CC2=CN(C3=CC=CC(O1)C23)S(=O)(=O)c1ccccc1
: