Target
Lysyl oxidase homolog 3
Ligand
BDBM50232679
Substrate
Meas. Tech.
ChEMBL_1648492 (CHEMBL3997548)
IC50
214±n/a nM
Citation
 Hutchinson, JHRowbottom, MWLonergan, DDarlington, JProdanovich, PKing, CDEvans, JFBain, G Small Molecule Lysyl Oxidase-like 2 (LOXL2) Inhibitors: The Identification of an Inhibitor Selective for LOXL2 over LOX. ACS Med Chem Lett 8:423-427 (2017)  
Target
Name:
Lysyl oxidase homolog 3
Synonyms:
1.4.3.- LOXL LOXL3_HUMAN Lysyl oxidase-like protein 3 | Synonyms=LOXL
Type:
PROTEIN
Mol. Mass.:
83173.13
Organism:
Homo sapiens (Human)
Description:
ChEMBL_117594
Residue:
753
  
Inhibitor
Name:
BDBM50232679
Synonyms:
CHEMBL4068784 | US11358936, Compound 4-5
Type:
Small organic molecule
Emp. Form.:
C6H7ClN2
Mol. Mass.:
142.586
SMILES:
NCc1ccnc(Cl)c1
: