Target
Lysyl oxidase homolog 2
Ligand
BDBM50232681
Substrate
Meas. Tech.
ChEMBL_1648485 (CHEMBL3997541)
IC50
203±n/a nM
Citation
 Hutchinson, JHRowbottom, MWLonergan, DDarlington, JProdanovich, PKing, CDEvans, JFBain, G Small Molecule Lysyl Oxidase-like 2 (LOXL2) Inhibitors: The Identification of an Inhibitor Selective for LOXL2 over LOX. ACS Med Chem Lett 8:423-427 (2017)  
Target
Name:
Lysyl oxidase homolog 2
Synonyms:
1.4.3.13 LOXL2_HUMAN Lysyl oxidase-like protein 2 Lysyl oxidase-related protein WS9-14
Type:
PROTEIN
Mol. Mass.:
86721.38
Organism:
Homo sapiens (Human)
Description:
ChEMBL_115990
Residue:
774
  
Inhibitor
Name:
BDBM50232681
Synonyms:
CHEMBL4099444 | US11358936, Compound 4-11
Type:
Small organic molecule
Emp. Form.:
C9H10N4
Mol. Mass.:
174.2025
SMILES:
NCc1ccnc(c1)-n1ccnc1
: