Target
Tyrosyl-DNA phosphodiesterase 1
Ligand
BDBM50232851
Substrate
Meas. Tech.
ChEMBL_1649249 (CHEMBL3998383)
IC50
1620±n/a nM
Citation
 Zakharenko, ALuzina, OKoval, ONilov, DGushchina, IDyrkheeva, N?vedas, VSalakhutdinov, NLavrik, O Tyrosyl-DNA Phosphodiesterase 1 Inhibitors: Usnic Acid Enamines Enhance the Cytotoxic Effect of Camptothecin. J Nat Prod 79:2961-2967 (2016)  
Target
Name:
Tyrosyl-DNA phosphodiesterase 1
Synonyms:
TDP1 Tyrosyl-DNA phosphodiesterase 1 | Tyrosyl-DNA phosphodiesterase 1 (TDP1)
Type:
Enzyme
Mol. Mass.:
68430.66
Organism:
Homo sapiens (Human)
Description:
Q9NUW8
Residue:
608
  
Inhibitor
Name:
BDBM50232851
Synonyms:
CHEMBL2207623
Type:
Small organic molecule
Emp. Form.:
C24H20ClNO6
Mol. Mass.:
453.872
SMILES:
CC(=O)c1c2OC3=CC(=O)\C(=C(\C)Nc4ccc(Cl)cc4)C(=O)[C@@]3(C)c2c(O)c(C)c1O
: