Target
Liver carboxylesterase 1
Ligand
BDBM50233191
Substrate
Meas. Tech.
ChEMBL_1649827 (CHEMBL3998961)
Ki
17±n/a nM
Citation
 Hatfield, MJChen, JFratt, EMChi, LBollinger, JCBinder, RJBowling, JHyatt, JLScarborough, JJeffries, CPotter, PM Selective Inhibitors of Human Liver Carboxylesterase Based on aß-Lapachone Scaffold: Novel Reagents for Reaction Profiling. J Med Chem 60:1568-1579 (2017)  
Target
Name:
Liver carboxylesterase 1
Synonyms:
Acyl coenzyme A:cholesterol acyltransferase CES1 EST1_HUMAN Serine hydrolase (CES1)
Type:
Protein
Mol. Mass.:
62520.83
Organism:
Homo sapiens (Human)
Description:
Residue:
567
  
Inhibitor
Name:
BDBM50233191
Synonyms:
CHEMBL4095556
Type:
Small organic molecule
Emp. Form.:
C17H12BrNO2
Mol. Mass.:
342.187
SMILES:
CN(C1=CC(=O)C(=O)c2ccccc12)c1ccc(Br)cc1
: