Target
Liver carboxylesterase 1
Ligand
BDBM50233196
Substrate
Meas. Tech.
ChEBML_1649827
Ki
18±n/a nM
Citation
 Hatfield, MJChen, JFratt, EMChi, LBollinger, JCBinder, RJBowling, JHyatt, JLScarborough, JJeffries, CPotter, PM Selective Inhibitors of Human Liver Carboxylesterase Based on aß-Lapachone Scaffold: Novel Reagents for Reaction Profiling. J Med Chem 60:1568-1579 (2017)  
Target
Name:
Liver carboxylesterase 1
Synonyms:
Acyl coenzyme A:cholesterol acyltransferase CES1 EST1_HUMAN Serine hydrolase (CES1)
Type:
Protein
Mol. Mass.:
62520.83
Organism:
Homo sapiens (Human)
Description:
Residue:
567
  
Inhibitor
Name:
BDBM50233196
Synonyms:
CHEMBL2391135
Type:
Small organic molecule
Emp. Form.:
C17H12O4
Mol. Mass.:
280.2748
SMILES:
COc1ccc(OC2=CC(=O)C(=O)c3ccccc23)cc1
: