Target
Estrogen receptor
Ligand
BDBM50233216
Substrate
Meas. Tech.
ChEMBL_1649839 (CHEMBL3998973)
EC50
0.070000±n/a nM
Citation
 Xiong, RZhao, JGutgesell, LMWang, YLee, SKarumudi, BZhao, HLu, YTonetti, DAThatcher, GR Novel Selective Estrogen Receptor Downregulators (SERDs) Developed against Treatment-Resistant Breast Cancer. J Med Chem 60:1325-1342 (2017)  
Target
Name:
Estrogen receptor
Synonyms:
ER ESR ESR1_HUMAN Estrogen receptor Estrogen receptor (ER-alpha) Estrogen receptor alpha (ER) Nuclear receptor subfamily 3 group A member 1
Type:
Protein
Mol. Mass.:
66230.44
Organism:
Homo sapiens (Human)
Description:
P03372
Residue:
595
  
Inhibitor
Name:
BDBM50233216
Synonyms:
CHEMBL4081807
Type:
Small organic molecule
Emp. Form.:
C26H19ClO5S
Mol. Mass.:
478.944
SMILES:
Cc1cc(Cl)cc(C)c1C(=O)c1sc2cc(O)ccc2c1Oc1ccc(\C=C\C(O)=O)cc1
: