Target
D(1A) dopamine receptor
Ligand
BDBM50429047
Substrate
Meas. Tech.
ChEMBL_1650504 (CHEMBL3999638)
Ki
49±n/a nM
Citation
 Lee, DYWLiu, JZhang, SHuang, PLiu-Chen, LY Asymmetric total synthesis of tetrahydroprotoberberine derivatives and evaluation of their binding affinities at dopamine receptors. Bioorg Med Chem Lett 27:1437-1440 (2017)  
Target
Name:
D(1A) dopamine receptor
Synonyms:
DA D1 receptor DRD1 Dopamine D1 receptor Dopamine D1A
Type:
Enzyme
Mol. Mass.:
49303.43
Organism:
Homo sapiens (Human)
Description:
P21728
Residue:
446
  
Inhibitor
Name:
BDBM50429047
Synonyms:
(-)-Tetrahydroberberine | CANADINE
Type:
Small organic molecule
Emp. Form.:
C20H21NO4
Mol. Mass.:
339.385
SMILES:
COc1ccc2C[C@@H]3N(CCc4cc5OCOc5cc34)Cc2c1OC
: