Target
Orexin receptor type 2
Ligand
BDBM202473
Substrate
Meas. Tech.
ChEMBL_1650583 (CHEMBL3999717)
Ki
0.400000±n/a nM
Citation
 Skudlarek, JWDiMarco, CNBabaoglu, KRoecker, AJBruno, JGPausch, MAO'Brien, JACabalu, TDStevens, JBrunner, JTannenbaum, PLWuelfing, WPGarson, SLFox, SVSavitz, ATHarrell, CMGotter, ALWinrow, CJRenger, JJKuduk, SDColeman, PJ Investigation of orexin-2 selective receptor antagonists: Structural modifications resulting in dual orexin receptor antagonists. Bioorg Med Chem Lett 27:1364-1370 (2017)  
Target
Name:
Orexin receptor type 2
Synonyms:
HCRTR2 OX2R_HUMAN Orexin receptor type 2 (OR-2) Orexin receptor type 2 (OX2R) Ox-2-R | Ox2-R
Type:
Protein
Mol. Mass.:
50710.53
Organism:
Homo sapiens (Human)
Description:
O43614
Residue:
444
  
Inhibitor
Name:
BDBM202473
Synonyms:
US9546152, example 1
Type:
Small organic molecule
Emp. Form.:
C22H22N6O2
Mol. Mass.:
402.4491
SMILES:
C[C@@H]1CC[C@H](CN1C(=O)c1ccccc1-n1nccn1)Oc1nccc(C#N)c1C
: