Target
E3 ubiquitin-protein ligase XIAP
Ligand
BDBM50233421
Substrate
Meas. Tech.
ChEMBL_1650842 (CHEMBL3999976)
IC50
1.4±n/a nM
Citation
 Abdel-Magid, AF Modulation of the Inhibitors of Apoptosis Proteins (IAPs) Activities for Cancer Treatment. ACS Med Chem Lett 8:471-473 (2017)  
Target
Name:
E3 ubiquitin-protein ligase XIAP
Synonyms:
API3 E3 ubiquitin-protein ligase XIAP Inhibitor of apoptosis protein 3 X-linked inhibitor of apoptosis XIAP | XIAP_HUMAN
Type:
Protein
Mol. Mass.:
56685.27
Organism:
Homo sapiens (Human)
Description:
P98170
Residue:
497
  
Inhibitor
Name:
BDBM50233421
Synonyms:
CHEMBL4075941
Type:
Small organic molecule
Emp. Form.:
C58H83N9O9S
Mol. Mass.:
1082.4
SMILES:
CN[C@@H](C)C(=O)N[C@H](C(=O)NC(Cc1ccc(cc1)[C@H]1C[C@H](N(C1)C(=O)[C@@H](NC(=O)[C@H](C)NC)C(C)(C)C)C(=O)N[C@@H]1CCCc2ccccc12)C(=O)N[C@@H]1CCCc2ccccc12)C(C)(C)SCC(=O)NC(CO)CO
: