Target
Proteinase-activated receptor 2
Ligand
BDBM50233748
Substrate
Meas. Tech.
ChEMBL_1651136 (CHEMBL4000391)
EC50
79±n/a nM
Citation
 Yau, MKSuen, JYXu, WLim, JLiu, LAdams, MNHe, YHooper, JDReid, RCFairlie, DP Potent Small Agonists of Protease Activated Receptor 2. ACS Med Chem Lett 7:105-10 (2016)  
Target
Name:
Proteinase-activated receptor 2
Synonyms:
F2RL1 PAR2 | PAR2_HUMAN
Type:
PROTEIN
Mol. Mass.:
44152.54
Organism:
Homo sapiens (Human)
Description:
ChEMBL_1497756
Residue:
397
  
Inhibitor
Name:
BDBM50233748
Synonyms:
CHEMBL4092076
Type:
Small organic molecule
Emp. Form.:
C27H45N9O6
Mol. Mass.:
591.7029
SMILES:
CC[C@H](C)[C@H](NC(=O)C(CC1CCCCC1)NC(=O)c1ccno1)C(=O)NCC(=O)N[C@@H](CCCNC(N)=N)C(N)=O
: