Target
Xanthine dehydrogenase/oxidase
Ligand
BDBM50233818
Substrate
Meas. Tech.
ChEMBL_1651246 (CHEMBL4000501)
IC50
>60000±n/a nM
Citation
 Tang, HJZhang, XWYang, LLi, WLi, JHWang, JXChen, J Synthesis and evaluation of xanthine oxidase inhibitory and antioxidant activities of 2-arylbenzo[b]furan derivatives based on salvianolic acid C. Eur J Med Chem 124:637-648 (2016)  
Target
Name:
Xanthine dehydrogenase/oxidase
Synonyms:
XD XDHA XO Xanthine dehydrogenase/oxidase | Xanthine oxidase
Type:
Enzyme
Mol. Mass.:
146441.21
Organism:
Homo sapiens (Human)
Description:
P47989
Residue:
1333
  
Inhibitor
Name:
BDBM50233818
Synonyms:
CHEMBL4092465
Type:
Small organic molecule
Emp. Form.:
C28H25NO7
Mol. Mass.:
487.5006
SMILES:
COC(=O)[C@H](Cc1ccccc1)NC(=O)\C=C\c1ccc(OC)c2oc(cc12)-c1ccc(O)c(O)c1
: