Target
Collagenase 3
Ligand
BDBM50233895
Substrate
Meas. Tech.
ChEMBL_1651669 (CHEMBL4000924)
IC50
0.043000±n/a nM
Citation
 Nara, HKaieda, ASato, KNaito, TMototani, HOki, HYamamoto, YKuno, HSantou, TKanzaki, NTerauchi, JUchikawa, OKori, M Discovery of Novel, Highly Potent, and Selective Matrix Metalloproteinase (MMP)-13 Inhibitors with a 1,2,4-Triazol-3-yl Moiety as a Zinc Binding Group Using a Structure-Based Design Approach. J Med Chem 60:608-626 (2017)  
Target
Name:
Collagenase 3
Synonyms:
MMP-13 MMP13_HUMAN Matrix metalloproteinase-13 (MMP-13) | Matrix metalloproteinase-13 (MMP13)
Type:
Enzyme
Mol. Mass.:
53808.06
Organism:
Homo sapiens (Human)
Description:
P45452
Residue:
471
  
Inhibitor
Name:
BDBM50233895
Synonyms:
CHEMBL4103367
Type:
Small organic molecule
Emp. Form.:
C22H18N6O4S2
Mol. Mass.:
494.546
SMILES:
O=C(NCc1cccc(OCCOc2nc[nH]n2)c1)c1nc2scc(-c3ccsc3)c2c(=O)[nH]1
: