Target
Collagenase 3
Ligand
BDBM50233888
Substrate
Meas. Tech.
ChEMBL_1651669 (CHEMBL4000924)
IC50
0.033000±n/a nM
Citation
 Nara, HKaieda, ASato, KNaito, TMototani, HOki, HYamamoto, YKuno, HSantou, TKanzaki, NTerauchi, JUchikawa, OKori, M Discovery of Novel, Highly Potent, and Selective Matrix Metalloproteinase (MMP)-13 Inhibitors with a 1,2,4-Triazol-3-yl Moiety as a Zinc Binding Group Using a Structure-Based Design Approach. J Med Chem 60:608-626 (2017)  
Target
Name:
Collagenase 3
Synonyms:
MMP-13 MMP13_HUMAN Matrix metalloproteinase-13 (MMP-13) | Matrix metalloproteinase-13 (MMP13)
Type:
Enzyme
Mol. Mass.:
53808.06
Organism:
Homo sapiens (Human)
Description:
P45452
Residue:
471
  
Inhibitor
Name:
BDBM50233888
Synonyms:
CHEMBL4092215
Type:
Small organic molecule
Emp. Form.:
C20H20N6O3S2
Mol. Mass.:
456.541
SMILES:
Cc1csc2nc([nH]c(=O)c12)C(=O)NCc1cccc(OCCCSc2nc[nH]n2)c1
: