Target
Cytochrome P450 2C8
Ligand
BDBM50234040
Substrate
Meas. Tech.
ChEMBL_1652006 (CHEMBL4001261)
IC50
>3000±n/a nM
Citation
 Markwalder, JASeitz, SPBlat, YElkin, LHunt, JTPabalan, JGJure-Kunkel, MNVite, GDCovello, K Identification and optimization of a novel series of indoleamine 2,3-dioxygenase inhibitors. Bioorg Med Chem Lett 27:582-585 (2017)  
Target
Name:
Cytochrome P450 2C8
Synonyms:
CP2C8_HUMAN CYPIIC8 P450 IIC2 P450 form 1 | S-mephenytoin 4-hydroxylase
Type:
Protein
Mol. Mass.:
55839.23
Organism:
Homo sapiens (Human)
Description:
P10632
Residue:
490
  
Inhibitor
Name:
BDBM50234040
Synonyms:
CHEMBL4060089 | US9765018, Example 114
Type:
Small organic molecule
Emp. Form.:
C31H27ClN2O5
Mol. Mass.:
543.009
SMILES:
COc1ccc(cc1C(O)=O)-c1ccc(Oc2cccc3CCCCc23)c(NC(=O)Nc2ccccc2Cl)c1
: