Target
Indoleamine 2,3-dioxygenase 1
Ligand
BDBM50234038
Substrate
Meas. Tech.
ChEMBL_1652013 (CHEMBL4001268)
IC50
4000±n/a nM
Citation
 Markwalder, JASeitz, SPBlat, YElkin, LHunt, JTPabalan, JGJure-Kunkel, MNVite, GDCovello, K Identification and optimization of a novel series of indoleamine 2,3-dioxygenase inhibitors. Bioorg Med Chem Lett 27:582-585 (2017)  
Target
Name:
Indoleamine 2,3-dioxygenase 1
Synonyms:
I23O1_HUMAN IDO-1 INDO Indoleamine 2,3-dioxygenase | Indoleamine-pyrrole 2,3-dioxygenase
Type:
Enzyme
Mol. Mass.:
45330.80
Organism:
Homo sapiens (Human)
Description:
P14902
Residue:
403
  
Inhibitor
Name:
BDBM50234038
Synonyms:
CHEMBL4097275
Type:
Small organic molecule
Emp. Form.:
C31H27F3N2O5
Mol. Mass.:
564.5517
SMILES:
CC(C)(C)c1ccccc1Oc1ccc(cc1NC(=O)Nc1ccc(OC(F)(F)F)cc1)-c1cccc(c1)C(O)=O
: